Reaction Details
TargetCannabinoid receptor 1
LigandBDBM50154566
Substrate/Competitorn/a
Meas. Tech.ChEMBL_1561402 (CHEMBL3778962)
Ki>10000±n/a nM
Citation Aghazadeh Tabrizi, MBaraldi, PGRuggiero, ESaponaro, GBaraldi, SPoli, GTuccinardi, TRavani, AVincenzi, FBorea, PAVarani, K Synthesis and structure activity relationship investigation of triazolo[1,5-a]pyrimidines as CB2 cannabinoid receptor inverse agonists. Eur J Med Chem113:11-27 (2016) 
 
Cannabinoid receptor 1
Name:Cannabinoid receptor 1
Type:G Protein-Coupled Receptor (GPCR)
Mol. Mass.:52868.96
Organism:Homo sapiens (Human)
Description:P21554
Residue:472
BDBM50154566
NameBDBM50154566
Synonyms:CHEMBL3775054
TypeSmall organic molecule
Emp. Form.C22H34N6O3
Mol. Mass.430.5438
SMILESCCCCCn1cc(C(=O)NC2CCCCCC2)c(=O)n2nc(nc12)N1CCOCC1