Reaction Details
TargetCannabinoid receptor 2
LigandBDBM50154567
Substrate/Competitorn/a
Meas. Tech.ChEMBL_1561407 (CHEMBL3778967)
EC50 464±n/a nM
Citation Aghazadeh Tabrizi, MBaraldi, PGRuggiero, ESaponaro, GBaraldi, SPoli, GTuccinardi, TRavani, AVincenzi, FBorea, PAVarani, K Synthesis and structure activity relationship investigation of triazolo[1,5-a]pyrimidines as CB2 cannabinoid receptor inverse agonists. Eur J Med Chem113:11-27 (2016) 
 
Cannabinoid receptor 2
Name:Cannabinoid receptor 2
Type:G Protein-Coupled Receptor (GPCR)
Mol. Mass.:39690.94
Organism:Homo sapiens (Human)
Description:P34972
Residue:360
BDBM50154567
NameBDBM50154567
Synonyms:CHEMBL3775199
TypeSmall organic molecule
Emp. Form.C24H31N5O2
Mol. Mass.421.5352
SMILESCCCCCn1cc(C(=O)NC2CCCCC2)c(=O)n2nc(nc12)-c1ccc(C)cc1