Reaction Details
TargetCannabinoid receptor 2
LigandBDBM50154626
Substrate/Competitorn/a
Meas. Tech.ChEMBL_1561403 (CHEMBL3778963)
Ki 514±n/a nM
Citation Aghazadeh Tabrizi, MBaraldi, PGRuggiero, ESaponaro, GBaraldi, SPoli, GTuccinardi, TRavani, AVincenzi, FBorea, PAVarani, K Synthesis and structure activity relationship investigation of triazolo[1,5-a]pyrimidines as CB2 cannabinoid receptor inverse agonists. Eur J Med Chem113:11-27 (2016) 
 
Cannabinoid receptor 2
Name:Cannabinoid receptor 2
Type:G Protein-Coupled Receptor (GPCR)
Mol. Mass.:39690.94
Organism:Homo sapiens (Human)
Description:P34972
Residue:360
BDBM50154626
NameBDBM50154626
Synonyms:CHEMBL3775571
TypeSmall organic molecule
Emp. Form.C18H27N5O2
Mol. Mass.345.4393
SMILESCCCCCn1cc(C(=O)NC2CCCCCC2)c(=O)n2ncnc12