Reaction Details
TargetCannabinoid receptor 2
LigandBDBM50154627
Substrate/Competitorn/a
Meas. Tech.ChEMBL_1561403 (CHEMBL3778963)
Ki 1352±n/a nM
Citation Aghazadeh Tabrizi, MBaraldi, PGRuggiero, ESaponaro, GBaraldi, SPoli, GTuccinardi, TRavani, AVincenzi, FBorea, PAVarani, K Synthesis and structure activity relationship investigation of triazolo[1,5-a]pyrimidines as CB2 cannabinoid receptor inverse agonists. Eur J Med Chem113:11-27 (2016) 
 
Cannabinoid receptor 2
Name:Cannabinoid receptor 2
Type:G Protein-Coupled Receptor (GPCR)
Mol. Mass.:39690.94
Organism:Homo sapiens (Human)
Description:P34972
Residue:360
BDBM50154627
NameBDBM50154627
Synonyms:CHEMBL3775561
TypeSmall organic molecule
Emp. Form.C23H34N6O2
Mol. Mass.426.5551
SMILESCCCCCn1cc(C(=O)NC2CCCCC2)c(=O)n2nc(nc12)N(CC=C)CC=C