Reaction Details
TargetCannabinoid receptor 2
LigandBDBM50154628
Substrate/Competitorn/a
Meas. Tech.ChEMBL_1561407 (CHEMBL3778967)
EC50 453±n/a nM
Citation Aghazadeh Tabrizi, MBaraldi, PGRuggiero, ESaponaro, GBaraldi, SPoli, GTuccinardi, TRavani, AVincenzi, FBorea, PAVarani, K Synthesis and structure activity relationship investigation of triazolo[1,5-a]pyrimidines as CB2 cannabinoid receptor inverse agonists. Eur J Med Chem113:11-27 (2016) 
 
Cannabinoid receptor 2
Name:Cannabinoid receptor 2
Type:G Protein-Coupled Receptor (GPCR)
Mol. Mass.:39690.94
Organism:Homo sapiens (Human)
Description:P34972
Residue:360
BDBM50154628
NameBDBM50154628
Synonyms:CHEMBL3774794
TypeSmall organic molecule
Emp. Form.C29H38N6O2
Mol. Mass.502.651
SMILESCCCCCn1cc(C(=O)NC23CC4CC(CC(C4)C2)C3)c(=O)n2nc(nc12)N(C)Cc1ccccc1