Reaction Details
TargetBromodomain-containing protein 4
LigandBDBM50365262
Substrate/Competitorn/a
Meas. Tech.ChEMBL_1565263 (CHEMBL3782657)
IC50 120±n/a nM
Citation Xue, XZhang, YLiu, ZSong, MXing, YXiang, QWang, ZTu, ZZhou, YDing, KXu, Y Discovery of Benzo[cd]indol-2(1H)-ones as Potent and Specific BET Bromodomain Inhibitors: Structure-Based Virtual Screening, Optimization, and Biological Evaluation. J Med Chem59:1565-79 (2016) 
 
Bromodomain-containing protein 4
Name:Bromodomain-containing protein 4
Type:Protein
Mol. Mass.:152264.84
Organism:Homo sapiens (Human)
Description:O60885
Residue:1362
BDBM50365262
NameBDBM50365262
Synonyms:(+)-JQ1 CHEMBL1957266 US10124009, Compound (S)-JQ1 US10308662, Compound JQ-1 US10617680, Example JQ-1 US10925881, Name (S)-JQ1 US11078188, Example (+)-JQ1 US11427593, Compound JQ1 US9320741, (S)-JQ1 | US9695172, JQ1
TypeSmall organic molecule
Emp. Form.C23H25ClN4O2S
Mol. Mass.456.988
SMILESCc1nnc2[C@H](CC(=O)OC(C)(C)C)N=C(c3c(C)c(C)sc3-n12)c1ccc(Cl)cc1