Reaction Details
TargetCannabinoid receptor 1
LigandBDBM26144
Substrate/Competitorn/a
Meas. Tech.ChEMBL_1565155 (CHEMBL3782513)
Ki 472±n/a nM
Citation Deiana, VGómez-Cañas, MPazos, MRFernández-Ruiz, JAsproni, BCichero, EFossa, PMuñoz, EDeligia, FMurineddu, GGarcía-Arencibia, MPinna, GA Tricyclic pyrazoles. Part 8. Synthesis, biological evaluation and modelling of tricyclic pyrazole carboxamides as potential CB2 receptor ligands with antagonist/inverse agonist properties. Eur J Med Chem112:66-80 (2016) 
 
Cannabinoid receptor 1
Name:Cannabinoid receptor 1
Type:G Protein-Coupled Receptor (GPCR)
Mol. Mass.:52856.55
Organism:Rattus norvegicus (rat)
Description:P20272
Residue:473
BDBM26144
NameBDBM26144
Synonyms:1,3-dihydroxypropan-2-yl (5Z,8Z,11Z,14Z)-icosa-5,8,11,14-tetraenoate 2-arachidonoylglycerol (2-AG) CHEMBL122972
TypeEndocannabinoids
Emp. Form.C23H38O4
Mol. Mass.378.5454
SMILESCCCCC\C=C/C\C=C/C\C=C/C\C=C/CCCC(=O)OC(CO)CO