Reaction Details
TargetOxidized purine nucleoside triphosphate hydrolase
LigandBDBM50152140
Substrate/Competitorn/a
Meas. Tech.ChEMBL_1565467 (CHEMBL3782136)
IC50 22±n/a nM
Citation Petrocchi, ALeo, EReyna, NJHamilton, MMShi, XParker, CAMseeh, FBardenhagen, JPLeonard, PCross, JBHuang, SJiang, YCardozo, MDraetta, GMarszalek, JRToniatti, CJones, PLewis, RT Identification of potent and selective MTH1 inhibitors. Bioorg Med Chem Lett26:1503-7 (2016) 
 
Oxidized purine nucleoside triphosphate hydrolase
Name:Oxidized purine nucleoside triphosphate hydrolase
Type:Protein
Mol. Mass.:22514.81
Organism:Homo sapiens (Human)
Description:P36639
Residue:197
BDBM50152140
NameBDBM50152140
Synonyms:CHEMBL3781296
TypeSmall organic molecule
Emp. Form.C9H14ClN3O2
Mol. Mass.231.679
SMILESCC(C)(CO)COc1nc(N)ncc1Cl