Reaction Details
TargetOxidized purine nucleoside triphosphate hydrolase
LigandBDBM50152144
Substrate/Competitorn/a
Meas. Tech.ChEMBL_1565467 (CHEMBL3782136)
IC50 0.200000±n/a nM
Citation Petrocchi, ALeo, EReyna, NJHamilton, MMShi, XParker, CAMseeh, FBardenhagen, JPLeonard, PCross, JBHuang, SJiang, YCardozo, MDraetta, GMarszalek, JRToniatti, CJones, PLewis, RT Identification of potent and selective MTH1 inhibitors. Bioorg Med Chem Lett26:1503-7 (2016) 
 
Oxidized purine nucleoside triphosphate hydrolase
Name:Oxidized purine nucleoside triphosphate hydrolase
Type:Protein
Mol. Mass.:22514.81
Organism:Homo sapiens (Human)
Description:P36639
Residue:197
BDBM50152144
NameBDBM50152144
Synonyms:CHEMBL3781661
TypeSmall organic molecule
Emp. Form.C10H17N3O
Mol. Mass.195.2615
SMILESCc1cnc(N)nc1OCC(C)(C)C