Reaction Details
TargetNuclear receptor ROR-gamma
LigandBDBM19993
Substrate/Competitorn/a
Meas. Tech.ChEMBL_1563237 (CHEMBL3784297)
IC50 3000±n/a nM
Citation Toyama, HSato, SShirakawa, HKomai, MHashimoto, YFujii, S Altered activity profile of a tertiary silanol analog of multi-targeting nuclear receptor modulator T0901317. Bioorg Med Chem Lett26:1817-20 (2016) 
 
Nuclear receptor ROR-gamma
Name:Nuclear receptor ROR-gamma
Type:Enzyme Catalytic Domain
Mol. Mass.:58218.40
Organism:Homo sapiens (Human)
Description:P51449
Residue:518
BDBM19993
NameBDBM19993
Synonyms:CHEMBL62136 T 0901317 TO-901317 US10669296, Compound TO901317 [3H]T0901317
TypeSmall organic molecule
Emp. Form.C17H12F9NO3S
Mol. Mass.481.333
SMILESOC(c1ccc(cc1)N(CC(F)(F)F)S(=O)(=O)c1ccccc1)(C(F)(F)F)C(F)(F)F