Reaction Details
TargetCarbonic anhydrase 1
LigandBDBM11638
Substrate/Competitorn/a
Meas. Tech.ChEMBL_1563412 (CHEMBL3782909)
Ki 1200±n/a nM
Citation Eminoglu, AVullo, DAsik, AÇolak, DNÇanakçi, SBeldüz, AOSupuran, CT Sulfonamide inhibition studies of theß-carbonic anhydrase from the newly discovered bacterium Enterobacter sp. B13. Bioorg Med Chem Lett26:1821-6 (2016) 
 
Carbonic anhydrase 1
Name:Carbonic anhydrase 1
Type:Enzyme
Mol. Mass.:28873.37
Organism:Homo sapiens (Human)
Description:P00915
Residue:261
BDBM11638
NameBDBM11638
Synonyms:CHEMBL26 N-[(1-ethylpyrrolidin-2-yl)methyl]-2-methoxy-5-sulfamoylbenzamide SULPIRIDE,(-) Sulpiride, SLP US10172837, Sulpiride
TypeSmall organic molecule
Emp. Form.C15H23N3O4S
Mol. Mass.341.426
SMILESCCN1CCCC1CNC(=O)c1cc(ccc1OC)S(N)(=O)=O