Reaction Details
TargetHepatocyte growth factor receptor
LigandBDBM50152682
Substrate/Competitorn/a
Meas. Tech.ChEMBL_1565051 (CHEMBL3782289)
IC50 6.8±n/a nM
Citation Tang, QZhai, XTu, YWang, PWang, LWu, CWang, WXie, HGong, PZheng, P Synthesis and antiproliferative activity of 6,7-disubstituted-4-phenoxyquinoline derivatives bearing the 2-oxo-4-chloro-1,2-dihydroquinoline-3-carboxamide moiety. Bioorg Med Chem Lett26:1794-8 (2016) 
 
Hepatocyte growth factor receptor
Name:Hepatocyte growth factor receptor
Type:Protein
Mol. Mass.:155559.73
Organism:Homo sapiens (Human)
Description:P08581
Residue:1390
BDBM50152682
NameBDBM50152682
Synonyms:CHEMBL3780662
TypeSmall organic molecule
Emp. Form.C41H38ClFN4O5
Mol. Mass.721.216
SMILESCOc1cc2c(Oc3ccc(NC(=O)c4c(Cl)c5ccccc5n(-c5ccccc5)c4=O)cc3F)ccnc2cc1OCCCN1CCC(C)CC1