Reaction Details
TargetSolute carrier family 2, facilitated glucose transporter member 3
LigandBDBM50155680
Substrate/Competitorn/a
Meas. Tech.ChEMBL_1565338 (CHEMBL3782732)
IC50 69±n/a nM
Citation Siebeneicher, HBauser, MBuchmann, BHeisler, IMüller, TNeuhaus, RRehwinkel, HTelser, JZorn, L Identification of novel GLUT inhibitors. Bioorg Med Chem Lett26:1732-7 (2016) 
 
Solute carrier family 2, facilitated glucose transporter member 3
Name:Solute carrier family 2, facilitated glucose transporter member 3
Type:PROTEIN
Mol. Mass.:53925.15
Organism:Homo sapiens (Human)
Description:ChEMBL_101113
Residue:496
BDBM50155680
NameBDBM50155680
Synonyms:CHEMBL3780717
TypeSmall organic molecule
Emp. Form.C22H19N7
Mol. Mass.381.4332
SMILESN#Cc1cccc(c1)N1CCN(CC1)c1ncnc2n(ncc12)-c1ccccc1