Reaction Details
TargetSolute carrier family 2, facilitated glucose transporter member 3
LigandBDBM50155750
Substrate/Competitorn/a
Meas. Tech.ChEMBL_1565338 (CHEMBL3782732)
IC50 340±n/a nM
Citation Siebeneicher, HBauser, MBuchmann, BHeisler, IMüller, TNeuhaus, RRehwinkel, HTelser, JZorn, L Identification of novel GLUT inhibitors. Bioorg Med Chem Lett26:1732-7 (2016) 
 
Solute carrier family 2, facilitated glucose transporter member 3
Name:Solute carrier family 2, facilitated glucose transporter member 3
Type:PROTEIN
Mol. Mass.:53925.15
Organism:Homo sapiens (Human)
Description:ChEMBL_101113
Residue:496
BDBM50155750
NameBDBM50155750
Synonyms:CHEMBL3780595
TypeSmall organic molecule
Emp. Form.C22H23N7O2
Mol. Mass.417.4637
SMILESCOc1ccc(cn1)-n1ncc2c(ncnc12)N1CCN(CC1)c1ccccc1OC