Reaction Details
TargetD(3) dopamine receptor
LigandBDBM50152837
Substrate/Competitorn/a
Meas. Tech.ChEMBL_1563481 (CHEMBL3783166)
Ki 101±n/a nM
Citation Gadhiya, SMadapa, SKurtzman, TAlberts, ILRamsey, SPillarsetty, NKKalidindi, THarding, WW Tetrahydroprotoberberine alkaloids with dopamine ands receptor affinity. Bioorg Med Chem24:2060-71 (2016) 
 
D(3) dopamine receptor
Name:D(3) dopamine receptor
Type:n/a
Mol. Mass.:44243.43
Organism:Homo sapiens (Human)
Description:n/a
Residue:400
BDBM50152837
NameBDBM50152837
Synonyms:CHEMBL595489
TypeSmall organic molecule
Emp. Form.C19H21NO4
Mol. Mass.327.3743
SMILESCOc1cc2CCN3Cc4c(CC3c2cc1O)ccc(O)c4OC