Reaction Details
TargetD(1A) dopamine receptor
LigandBDBM50152847
Substrate/Competitorn/a
Meas. Tech.ChEMBL_1563479 (CHEMBL3783164)
Ki 12±n/a nM
Citation Gadhiya, SMadapa, SKurtzman, TAlberts, ILRamsey, SPillarsetty, NKKalidindi, THarding, WW Tetrahydroprotoberberine alkaloids with dopamine ands receptor affinity. Bioorg Med Chem24:2060-71 (2016) 
 
D(1A) dopamine receptor
Name:D(1A) dopamine receptor
Type:Enzyme
Mol. Mass.:49303.43
Organism:Homo sapiens (Human)
Description:P21728
Residue:446
BDBM50152847
NameBDBM50152847
Synonyms:CHEMBL3779928
TypeSmall organic molecule
Emp. Form.C21H25NO4
Mol. Mass.355.4275
SMILESCCOc1ccc2CC3N(CCc4cc(OC)c(O)cc34)Cc2c1OC