Reaction Details
TargetCoagulation factor XI
LigandBDBM50153012
Substrate/Competitorn/a
Meas. Tech.ChEBML_1563872
Ki 9.1±n/a nM
Citation Corte, JRFang, TPinto, DJOrwat, MJRendina, ARLuettgen, JMRossi, KAWei, ARamamurthy, VMyers, JESheriff, SNarayanan, RHarper, TWZheng, JJLi, YXSeiffert, DAWexler, RRQuan, ML Orally bioavailable pyridine and pyrimidine-based Factor XIa inhibitors: Discovery of the methyl N-phenyl carbamate P2 prime group. Bioorg Med Chem24:2257-72 (2016) 
 
Coagulation factor XI
Name:Coagulation factor XI
Type:Enzyme
Mol. Mass.:70130.58
Organism:Homo sapiens (Human)
Description:P03951
Residue:625
BDBM50153012
NameBDBM50153012
Synonyms:CHEMBL3781550
TypeSmall organic molecule
Emp. Form.C28H33N5O3
Mol. Mass.487.5933
SMILESCOC(=O)Nc1ccc(cc1)-c1cc(ncn1)[C@H](Cc1ccccc1)NC(=O)[C@H]1CC[C@H](CN)CC1