Reaction Details
TargetCoagulation factor XI
LigandBDBM50153055
Substrate/Competitorn/a
Meas. Tech.ChEBML_1563872
Ki 110±n/a nM
Citation Corte, JRFang, TPinto, DJOrwat, MJRendina, ARLuettgen, JMRossi, KAWei, ARamamurthy, VMyers, JESheriff, SNarayanan, RHarper, TWZheng, JJLi, YXSeiffert, DAWexler, RRQuan, ML Orally bioavailable pyridine and pyrimidine-based Factor XIa inhibitors: Discovery of the methyl N-phenyl carbamate P2 prime group. Bioorg Med Chem24:2257-72 (2016) 
 
Coagulation factor XI
Name:Coagulation factor XI
Type:Enzyme
Mol. Mass.:70130.58
Organism:Homo sapiens (Human)
Description:P03951
Residue:625
BDBM50153055
NameBDBM50153055
Synonyms:CHEMBL3781691
TypeSmall organic molecule
Emp. Form.C29H33N5O2
Mol. Mass.483.6046
SMILESCn1[nH]c2ccc(cc2c1=O)-c1ccnc(c1)C(Cc1ccccc1)NC(=O)[C@H]1CC[C@H](CN)CC1