Reaction Details
TargetCoagulation factor IX
LigandBDBM50153057
Substrate/Competitorn/a
Meas. Tech.ChEBML_1563870
Ki>34860±n/a nM
Citation Corte, JRFang, TPinto, DJOrwat, MJRendina, ARLuettgen, JMRossi, KAWei, ARamamurthy, VMyers, JESheriff, SNarayanan, RHarper, TWZheng, JJLi, YXSeiffert, DAWexler, RRQuan, ML Orally bioavailable pyridine and pyrimidine-based Factor XIa inhibitors: Discovery of the methyl N-phenyl carbamate P2 prime group. Bioorg Med Chem24:2257-72 (2016) 
 
Coagulation factor IX
Name:Coagulation factor IX
Type:Enzyme
Mol. Mass.:51768.83
Organism:Homo sapiens (Human)
Description:P00740
Residue:461
BDBM50153057
NameBDBM50153057
Synonyms:CHEMBL3780324
TypeSmall organic molecule
Emp. Form.C28H31N5O2
Mol. Mass.469.578
SMILESNC[C@H]1CC[C@@H](CC1)C(=O)N[C@@H](Cc1ccccc1)c1cc(ccn1)-c1ccc2[nH]nc(O)c2c1