Reaction Details
TargetProthrombin
LigandBDBM50103200
Substrate/Competitorn/a
Meas. Tech.ChEBML_1564073
Ki>12610±n/a nM
Citation Corte, JRFang, TPinto, DJOrwat, MJRendina, ARLuettgen, JMRossi, KAWei, ARamamurthy, VMyers, JESheriff, SNarayanan, RHarper, TWZheng, JJLi, YXSeiffert, DAWexler, RRQuan, ML Orally bioavailable pyridine and pyrimidine-based Factor XIa inhibitors: Discovery of the methyl N-phenyl carbamate P2 prime group. Bioorg Med Chem24:2257-72 (2016) 
 
Prothrombin
Name:Prothrombin
Type:Protein
Mol. Mass.:70029.57
Organism:Homo sapiens (Human)
Description:P00734
Residue:622
BDBM50103200
NameBDBM50103200
Synonyms:CHEMBL3393386
TypeSmall organic molecule
Emp. Form.C28H32N6O
Mol. Mass.468.5933
SMILESNC[C@H]1CC[C@@H](CC1)C(=O)N[C@@H](Cc1ccccc1)c1cc(ccn1)-c1ccc2c(N)n[nH]c2c1