Reaction Details
TargetVitamin K-dependent protein C
LigandBDBM50153049
Substrate/Competitorn/a
Meas. Tech.ChEBML_1564076
Ki>30220±n/a nM
Citation Corte, JRFang, TPinto, DJOrwat, MJRendina, ARLuettgen, JMRossi, KAWei, ARamamurthy, VMyers, JESheriff, SNarayanan, RHarper, TWZheng, JJLi, YXSeiffert, DAWexler, RRQuan, ML Orally bioavailable pyridine and pyrimidine-based Factor XIa inhibitors: Discovery of the methyl N-phenyl carbamate P2 prime group. Bioorg Med Chem24:2257-72 (2016) 
 
Vitamin K-dependent protein C
Name:Vitamin K-dependent protein C
Type:Enzyme
Mol. Mass.:52067.73
Organism:Homo sapiens (Human)
Description:n/a
Residue:461
BDBM50153049
NameBDBM50153049
Synonyms:CHEMBL3781788
TypeSmall organic molecule
Emp. Form.C29H34N4O3
Mol. Mass.486.6053
SMILESCOC(=O)Nc1ccc(cc1)-c1ccnc(c1)[C@H](Cc1ccccc1)NC(=O)[C@H]1CC[C@H](CN)CC1