Reaction Details
TargetQuinolone resistance protein NorA
LigandBDBM50153183
Substrate/Competitorn/a
Meas. Tech.ChEMBL_1562415 (CHEMBL3778151)
IC50 5000±n/a nM
Citation Lepri, SBuonerba, FGoracci, LVelilla, IRuzziconi, RSchindler, BDSeo, SMKaatz, GWCruciani, G Indole Based Weapons to Fight Antibiotic Resistance: A Structure-Activity Relationship Study. J Med Chem59:867-91 (2016) 
 
Quinolone resistance protein NorA
Name:Quinolone resistance protein NorA
Type:PROTEIN
Mol. Mass.:42273.03
Organism:Staphylococcus aureus
Description:ChEMBL_961221
Residue:388
BDBM50153183
NameBDBM50153183
Synonyms:CHEMBL3774548
TypeSmall organic molecule
Emp. Form.C28H36N2O4
Mol. Mass.464.5964
SMILESCCOC(=O)c1c(C)n(Cc2ccccc2OC)c2ccc(OCCCN3CCCCC3)cc12