Reaction Details
TargetLysine-specific demethylase 4C
LigandBDBM50153324
Substrate/Competitorn/a
Meas. Tech.ChEMBL_1562605 (CHEMBL3779254)
IC50 6310±n/a nM
Citation Westaway, SMPreston, AGBarker, MDBrown, FBrown, JACampbell, MChung, CWDiallo, HDouault, CDrewes, GEagle, RGordon, LHaslam, CHayhow, TGHumphreys, PGJoberty, GKatso, RKruidenier, LLeveridge, MLiddle, JMosley, JMuelbaier, MRandle, RRioja, IRueger, ASeal, GASheppard, RJSingh, OTaylor, JThomas, PThomson, DWilson, DMLee, KPrinjha, RK Cell Penetrant Inhibitors of the KDM4 and KDM5 Families of Histone Lysine Demethylases. 1. 3-Amino-4-pyridine Carboxylate Derivatives. J Med Chem59:1357-69 (2016) 
 
Lysine-specific demethylase 4C
Name:Lysine-specific demethylase 4C
Type:Protein
Mol. Mass.:119979.01
Organism:Homo sapiens (Human)
Description:Q9H3R0
Residue:1056
BDBM50153324
NameBDBM50153324
Synonyms:CHEMBL3774408
TypeSmall organic molecule
Emp. Form.C16H18N2O2
Mol. Mass.270.3263
SMILESOC(=O)c1ccncc1NCCCCc1ccccc1