Reaction Details
TargetLysine-specific demethylase 6B
LigandBDBM50153347
Substrate/Competitorn/a
Meas. Tech.ChEMBL_1562427 (CHEMBL3778163)
IC50 1995±n/a nM
Citation Westaway, SMPreston, AGBarker, MDBrown, FBrown, JACampbell, MChung, CWDiallo, HDouault, CDrewes, GEagle, RGordon, LHaslam, CHayhow, TGHumphreys, PGJoberty, GKatso, RKruidenier, LLeveridge, MLiddle, JMosley, JMuelbaier, MRandle, RRioja, IRueger, ASeal, GASheppard, RJSingh, OTaylor, JThomas, PThomson, DWilson, DMLee, KPrinjha, RK Cell Penetrant Inhibitors of the KDM4 and KDM5 Families of Histone Lysine Demethylases. 1. 3-Amino-4-pyridine Carboxylate Derivatives. J Med Chem59:1357-69 (2016) 
 
Lysine-specific demethylase 6B
Name:Lysine-specific demethylase 6B
Type:Protein
Mol. Mass.:176672.55
Organism:Homo sapiens (Human)
Description:O15054
Residue:1643
BDBM50153347
NameBDBM50153347
Synonyms:CHEMBL3775952
TypeSmall organic molecule
Emp. Form.C10H14N2O2
Mol. Mass.194.2304
SMILESCC(C)CNc1cnccc1C(O)=O