Reaction Details
TargetLysine-specific demethylase 6B
LigandBDBM50153350
Substrate/Competitorn/a
Meas. Tech.ChEMBL_1562427 (CHEMBL3778163)
IC50 794±n/a nM
Citation Westaway, SMPreston, AGBarker, MDBrown, FBrown, JACampbell, MChung, CWDiallo, HDouault, CDrewes, GEagle, RGordon, LHaslam, CHayhow, TGHumphreys, PGJoberty, GKatso, RKruidenier, LLeveridge, MLiddle, JMosley, JMuelbaier, MRandle, RRioja, IRueger, ASeal, GASheppard, RJSingh, OTaylor, JThomas, PThomson, DWilson, DMLee, KPrinjha, RK Cell Penetrant Inhibitors of the KDM4 and KDM5 Families of Histone Lysine Demethylases. 1. 3-Amino-4-pyridine Carboxylate Derivatives. J Med Chem59:1357-69 (2016) 
 
Lysine-specific demethylase 6B
Name:Lysine-specific demethylase 6B
Type:Protein
Mol. Mass.:176672.55
Organism:Homo sapiens (Human)
Description:O15054
Residue:1643
BDBM50153350
NameBDBM50153350
Synonyms:CHEMBL3774399
TypeSmall organic molecule
Emp. Form.C15H16N2O2
Mol. Mass.256.2997
SMILESOC(=O)c1ccncc1NCCCc1ccccc1