Reaction Details
TargetLysine-specific demethylase 4D
LigandBDBM50153318
Substrate/Competitorn/a
Meas. Tech.ChEMBL_1562429 (CHEMBL3778165)
IC50 100±n/a nM
Citation Westaway, SMPreston, AGBarker, MDBrown, FBrown, JACampbell, MChung, CWDiallo, HDouault, CDrewes, GEagle, RGordon, LHaslam, CHayhow, TGHumphreys, PGJoberty, GKatso, RKruidenier, LLeveridge, MLiddle, JMosley, JMuelbaier, MRandle, RRioja, IRueger, ASeal, GASheppard, RJSingh, OTaylor, JThomas, PThomson, DWilson, DMLee, KPrinjha, RK Cell Penetrant Inhibitors of the KDM4 and KDM5 Families of Histone Lysine Demethylases. 1. 3-Amino-4-pyridine Carboxylate Derivatives. J Med Chem59:1357-69 (2016) 
 
Lysine-specific demethylase 4D
Name:Lysine-specific demethylase 4D
Type:PROTEIN
Mol. Mass.:58627.79
Organism:Homo sapiens (Human)
Description:ChEMBL_102441
Residue:523
BDBM50153318
NameBDBM50153318
Synonyms:CHEMBL3775237
TypeSmall organic molecule
Emp. Form.C11H10N2O3
Mol. Mass.218.2087
SMILESOC(=O)c1ccncc1NCc1ccco1