Reaction Details
TargetLysine-specific demethylase 5C
LigandBDBM50153320
Substrate/Competitorn/a
Meas. Tech.ChEMBL_1562608 (CHEMBL3779257)
IC50<100000±n/a nM
Citation Westaway, SMPreston, AGBarker, MDBrown, FBrown, JACampbell, MChung, CWDiallo, HDouault, CDrewes, GEagle, RGordon, LHaslam, CHayhow, TGHumphreys, PGJoberty, GKatso, RKruidenier, LLeveridge, MLiddle, JMosley, JMuelbaier, MRandle, RRioja, IRueger, ASeal, GASheppard, RJSingh, OTaylor, JThomas, PThomson, DWilson, DMLee, KPrinjha, RK Cell Penetrant Inhibitors of the KDM4 and KDM5 Families of Histone Lysine Demethylases. 1. 3-Amino-4-pyridine Carboxylate Derivatives. J Med Chem59:1357-69 (2016) 
 
Lysine-specific demethylase 5C
Name:Lysine-specific demethylase 5C
Type:PROTEIN
Mol. Mass.:175691.17
Organism:Homo sapiens (Human)
Description:P41229
Residue:1560
BDBM50153320
NameBDBM50153320
Synonyms:CHEMBL3774615
TypeSmall organic molecule
Emp. Form.C11H10N2O3
Mol. Mass.218.2087
SMILESOC(=O)c1cccnc1NCc1ccco1