Reaction Details
TargetLysine-specific demethylase 4C
LigandBDBM50153346
Substrate/Competitorn/a
Meas. Tech.ChEMBL_1562428 (CHEMBL3778164)
IC50 63096±n/a nM
Citation Westaway, SMPreston, AGBarker, MDBrown, FBrown, JACampbell, MChung, CWDiallo, HDouault, CDrewes, GEagle, RGordon, LHaslam, CHayhow, TGHumphreys, PGJoberty, GKatso, RKruidenier, LLeveridge, MLiddle, JMosley, JMuelbaier, MRandle, RRioja, IRueger, ASeal, GASheppard, RJSingh, OTaylor, JThomas, PThomson, DWilson, DMLee, KPrinjha, RK Cell Penetrant Inhibitors of the KDM4 and KDM5 Families of Histone Lysine Demethylases. 1. 3-Amino-4-pyridine Carboxylate Derivatives. J Med Chem59:1357-69 (2016) 
 
Lysine-specific demethylase 4C
Name:Lysine-specific demethylase 4C
Type:Protein
Mol. Mass.:119979.01
Organism:Homo sapiens (Human)
Description:Q9H3R0
Residue:1056
BDBM50153346
NameBDBM50153346
Synonyms:CHEMBL3775366
TypeSmall organic molecule
Emp. Form.C8H11N3O2
Mol. Mass.181.1918
SMILESNCCNc1cnccc1C(O)=O