Reaction Details
TargetFatty-acid amide hydrolase 1 [30-579]
LigandBDBM50074922
Substrate/Competitorn/a
Meas. Tech.ChEMBL_1562611 (CHEMBL3779260)
IC50>100000±n/a nM
Citation Migliore, MHabrant, DSasso, OAlbani, CBertozzi, SMArmirotti, APiomelli, DScarpelli, R Potent multitarget FAAH-COX inhibitors: Design and structure-activity relationship studies. Eur J Med Chem109:216-37 (2016) 
 
Fatty-acid amide hydrolase 1 [30-579]
Name:Fatty-acid amide hydrolase 1 [30-579]
Type:Single-pass membrane protein; homodimer
Mol. Mass.:60474.00
Organism:Rattus norvegicus (rat)
Description:P97612 (aa 30-579)
Residue:550
BDBM50074922
NameBDBM50074922
Synonyms:(+-)-2-fluoro-alpha-methyl-4-biphenylacetic acid 2-(2-fluorobiphenyl-4-yl)propanoic acid 3-fluoro-4-phenylhydratropic acid CHEMBL563 US9630914, Compound A
TypeSmall organic molecule
Emp. Form.C15H13FO2
Mol. Mass.244.2609
SMILESCC(C(O)=O)c1ccc(c(F)c1)-c1ccccc1