Reaction Details
TargetProstaglandin G/H synthase 1
LigandBDBM50153360
Substrate/Competitorn/a
Meas. Tech.ChEMBL_1562612 (CHEMBL3779261)
IC50 0.290000±n/a nM
Citation Migliore, MHabrant, DSasso, OAlbani, CBertozzi, SMArmirotti, APiomelli, DScarpelli, R Potent multitarget FAAH-COX inhibitors: Design and structure-activity relationship studies. Eur J Med Chem109:216-37 (2016) 
 
Prostaglandin G/H synthase 1
Name:Prostaglandin G/H synthase 1
Type:Protein
Mol. Mass.:68868.60
Organism:Ovis aries (Sheep)
Description:n/a
Residue:600
BDBM50153360
NameBDBM50153360
Synonyms:CHEMBL3774784
TypeSmall organic molecule
Emp. Form.C22H26FNO4
Mol. Mass.387.4445
SMILESCCCCCCNC(=O)Oc1cccc(c1)-c1ccc(cc1F)[C@H](C)C(O)=O