Reaction Details
TargetCorticotropin-releasing factor receptor 1
LigandBDBM50153498
Substrate/Competitorn/a
Meas. Tech.ChEMBL_1560862 (CHEMBL3778934)
Ki 0.250000±n/a nM
Citation Erchegyi, JWang, LGulyas, JSamant, MPerrin, MHLewis, KMiller, CVaughan, JDonaldson, CFischer, WLow, WYakabi, SKarasawa, HTaché, YRivier, CRivier, J Characterization of Multisubstituted Corticotropin Releasing Factor (CRF) Peptide Antagonists (Astressins). J Med Chem59:854-66 (2016) 
 
Corticotropin-releasing factor receptor 1
Name:Corticotropin-releasing factor receptor 1
Type:Enzyme
Mol. Mass.:50744.31
Organism:Homo sapiens (Human)
Description:P34998
Residue:444
BDBM50153498
NameBDBM50153498
Synonyms:CHEMBL3774682
TypeSmall organic molecule
Emp. Form.C180H294N52O49S
Mol. Mass.4002.644
SMILESCCCCC(NC(=O)[C@H](CCC(O)=O)NC(=O)[C@H](CC(C)C)NC(=O)[C@@H](NC(=O)[C@H](CCC(O)=O)NC(=O)[C@H](CCCNC(N)=N)NC(=O)[C@H](CC(C)C)NC(=O)[C@H](CC(C)C)NC(=O)[C@H](Cc1cnc[nH]1)NC(=O)[C@@H](Cc1ccccc1)NC(=O)[C@@H](NC(=O)[C@H](CC(C)C)NC(=O)[C@H](CC(O)=O)NC(C)=O)[C@@H](C)O)C(C)C)C(=O)N[C@@H](C)C(=O)N[C@@H](CCCNC(N)=N)C(=O)N[C@@H](C)C(=O)N[C@@H](CCC(O)=O)C(=O)N[C@@H](CCC(N)=O)C(=O)NC(C)(CC(C)C)C(=O)N[C@@H](C)C(=O)N[C@@H](CCC(N)=O)C(=O)N[C@H]1CCC(=O)NCCCC[C@H](NC(=O)[C@H](Cc2cnc[nH]2)NC(=O)[C@H](C)NC1=O)C(=O)N[C@@H](CC(N)=O)C(=O)N[C@@H](CCCNC(N)=N)C(=O)N[C@@H](CCCCN)C(=O)N[C@@H](CC(C)C)C(=O)NC(Cc1ccsc1)C(=O)N[C@@H](CCC(O)=O)C(=O)NC(C)(CC(C)C)C(=O)N[C@@H]([C@@H](C)CC)C(N)=O