Reaction Details
TargetCorticotropin-releasing factor receptor 2
LigandBDBM50153473
Substrate/Competitorn/a
Meas. Tech.ChEMBL_1560844 (CHEMBL3778916)
EC50 1.000000±n/a nM
Citation Erchegyi, JWang, LGulyas, JSamant, MPerrin, MHLewis, KMiller, CVaughan, JDonaldson, CFischer, WLow, WYakabi, SKarasawa, HTaché, YRivier, CRivier, J Characterization of Multisubstituted Corticotropin Releasing Factor (CRF) Peptide Antagonists (Astressins). J Med Chem59:854-66 (2016) 
 
Corticotropin-releasing factor receptor 2
Name:Corticotropin-releasing factor receptor 2
Type:Enzyme Catalytic Domain
Mol. Mass.:47697.09
Organism:RAT
Description:CRF2 Beta 0 RAT::P47866
Residue:411
BDBM50153473
NameBDBM50153473
Synonyms:CHEMBL3775796
TypeSmall organic molecule
Emp. Form.C179H298N52O49
Mol. Mass.3962.6004
SMILESCCCCC(NC(=O)[C@H](CCC(O)=O)NC(=O)[C@H](CC(C)C)NC(=O)[C@@H](NC(=O)[C@H](CCC(O)=O)NC(=O)[C@H](CCCNC(N)=N)NC(=O)[C@H](CC(C)C)NC(=O)[C@H](CC(C)C)NC(=O)[C@H](Cc1cnc[nH]1)NC(=O)[C@@H](Cc1ccccc1)NC(=O)[C@@H](NC(=O)[C@H](CC(C)C)NC(=O)[C@H](CC(O)=O)NC(C)=O)[C@@H](C)O)C(C)C)C(=O)N[C@@H](C)C(=O)N[C@@H](CCCNC(N)=N)C(=O)N[C@@H](C)C(=O)N[C@@H](CCC(O)=O)C(=O)N[C@@H](CCC(N)=O)C(=O)NC(C)(CC(C)C)C(=O)N[C@@H](C)C(=O)N[C@@H](CCC(N)=O)C(=O)N[C@H]1CCC(=O)NCCCC[C@H](NC(=O)[C@H](Cc2cnc[nH]2)NC(=O)[C@H](C)NC1=O)C(=O)N[C@@H](CC(N)=O)C(=O)N[C@@H](CCCNC(N)=N)C(=O)N[C@@H](CCCCN)C(=O)N[C@@H](CC(C)C)C(=O)NC(CCCC)C(=O)N[C@@H](CCC(O)=O)C(=O)NC(C)(CC(C)C)C(=O)N[C@@H]([C@@H](C)CC)C(N)=O