Reaction Details
TargetCytochrome P450 2A6
LigandBDBM50153594
Substrate/Competitorn/a
Meas. Tech.ChEMBL_1561112 (CHEMBL3776836)
IC50>50000±n/a nM
Citation Hirata, KKotoku, MSeki, NMaeba, TMaeda, KHirashima, SSakai, TObika, SHori, AHase, YYamaguchi, TKatsuda, YHata, TMiyagawa, NArita, KNomura, YAsahina, KAratsu, YKamada, MAdachi, TNoguchi, MDoi, SCrowe, PBradley, ESteensma, RTao, HFenn, MBabine, RLi, XThacher, SHashimoto, HShiozaki, M SAR Exploration Guided by LE and Fsp(3): Discovery of a Selective and Orally Efficacious ROR¿ Inhibitor. ACS Med Chem Lett7:23-7 (2016) 
 
Cytochrome P450 2A6
Name:Cytochrome P450 2A6
Type:Protein
Mol. Mass.:56514.34
Organism:Homo sapiens (Human)
Description:P11509
Residue:494
BDBM50153594
NameBDBM50153594
Synonyms:CHEMBL3774855
TypeSmall organic molecule
Emp. Form.C28H39N5O2
Mol. Mass.477.6416
SMILESCC(C)C[C@H]1C[C@H](C1)c1nnc([C@H]2CN(C[C@@H]2C(=O)Nc2ccc(C)cc2C)C(C)=O)n1C1CC1