Reaction Details
TargetNuclear receptor ROR-gamma
LigandBDBM50153601
Substrate/Competitorn/a
Meas. Tech.ChEMBL_1561096 (CHEMBL3776820)
EC50 1700±n/a nM
Citation Hirata, KKotoku, MSeki, NMaeba, TMaeda, KHirashima, SSakai, TObika, SHori, AHase, YYamaguchi, TKatsuda, YHata, TMiyagawa, NArita, KNomura, YAsahina, KAratsu, YKamada, MAdachi, TNoguchi, MDoi, SCrowe, PBradley, ESteensma, RTao, HFenn, MBabine, RLi, XThacher, SHashimoto, HShiozaki, M SAR Exploration Guided by LE and Fsp(3): Discovery of a Selective and Orally Efficacious ROR¿ Inhibitor. ACS Med Chem Lett7:23-7 (2016) 
 
Nuclear receptor ROR-gamma
Name:Nuclear receptor ROR-gamma
Type:Enzyme Catalytic Domain
Mol. Mass.:58218.40
Organism:Homo sapiens (Human)
Description:P51449
Residue:518
BDBM50153601
NameBDBM50153601
Synonyms:CHEMBL3775184
TypeSmall organic molecule
Emp. Form.C27H28N4O
Mol. Mass.424.5374
SMILESCCn1c(nnc1C1Cc2ccccc2C1)C(C)CC(=O)Nc1cccc2ccccc12