Reaction Details
TargetNuclear receptor ROR-gamma
LigandBDBM50153622
Substrate/Competitorn/a
Meas. Tech.ChEMBL_1561096 (CHEMBL3776820)
EC50 6700±n/a nM
Citation Hirata, KKotoku, MSeki, NMaeba, TMaeda, KHirashima, SSakai, TObika, SHori, AHase, YYamaguchi, TKatsuda, YHata, TMiyagawa, NArita, KNomura, YAsahina, KAratsu, YKamada, MAdachi, TNoguchi, MDoi, SCrowe, PBradley, ESteensma, RTao, HFenn, MBabine, RLi, XThacher, SHashimoto, HShiozaki, M SAR Exploration Guided by LE and Fsp(3): Discovery of a Selective and Orally Efficacious ROR¿ Inhibitor. ACS Med Chem Lett7:23-7 (2016) 
 
Nuclear receptor ROR-gamma
Name:Nuclear receptor ROR-gamma
Type:Enzyme Catalytic Domain
Mol. Mass.:58218.40
Organism:Homo sapiens (Human)
Description:P51449
Residue:518
BDBM50153622
NameBDBM50153622
Synonyms:CHEMBL3775712
TypeSmall organic molecule
Emp. Form.C23H30N4O
Mol. Mass.378.5105
SMILESCCn1c(CCC(=O)Nc2cccc3ccccc23)nnc1CCC(C)(C)C