Reaction Details
TargetNuclear receptor ROR-gamma
LigandBDBM50153598
Substrate/Competitorn/a
Meas. Tech.ChEMBL_1561096 (CHEMBL3776820)
EC50 140±n/a nM
Citation Hirata, KKotoku, MSeki, NMaeba, TMaeda, KHirashima, SSakai, TObika, SHori, AHase, YYamaguchi, TKatsuda, YHata, TMiyagawa, NArita, KNomura, YAsahina, KAratsu, YKamada, MAdachi, TNoguchi, MDoi, SCrowe, PBradley, ESteensma, RTao, HFenn, MBabine, RLi, XThacher, SHashimoto, HShiozaki, M SAR Exploration Guided by LE and Fsp(3): Discovery of a Selective and Orally Efficacious ROR¿ Inhibitor. ACS Med Chem Lett7:23-7 (2016) 
 
Nuclear receptor ROR-gamma
Name:Nuclear receptor ROR-gamma
Type:Enzyme Catalytic Domain
Mol. Mass.:58218.40
Organism:Homo sapiens (Human)
Description:P51449
Residue:518
BDBM50153598
NameBDBM50153598
Synonyms:CHEMBL3775828
TypeSmall organic molecule
Emp. Form.C24H34N4O
Mol. Mass.394.553
SMILESCC(C)C[C@H]1C[C@H](C1)c1nnc(CCC(=O)Nc2ccc(C)cc2C)n1C1CC1