Reaction Details
TargetNuclear receptor ROR-gamma
LigandBDBM50153649
Substrate/Competitorn/a
Meas. Tech.ChEMBL_1561097 (CHEMBL3776821)
EC50 1800±n/a nM
Citation Hirata, KKotoku, MSeki, NMaeba, TMaeda, KHirashima, SSakai, TObika, SHori, AHase, YYamaguchi, TKatsuda, YHata, TMiyagawa, NArita, KNomura, YAsahina, KAratsu, YKamada, MAdachi, TNoguchi, MDoi, SCrowe, PBradley, ESteensma, RTao, HFenn, MBabine, RLi, XThacher, SHashimoto, HShiozaki, M SAR Exploration Guided by LE and Fsp(3): Discovery of a Selective and Orally Efficacious ROR¿ Inhibitor. ACS Med Chem Lett7:23-7 (2016) 
 
Nuclear receptor ROR-gamma
Name:Nuclear receptor ROR-gamma
Type:PROTEIN
Mol. Mass.:58133.31
Organism:Mus musculus
Description:ChEMBL_103664
Residue:516
BDBM50153649
NameBDBM50153649
Synonyms:CHEMBL3775324
TypeSmall organic molecule
Emp. Form.C25H36N4O
Mol. Mass.408.5795
SMILESCc1ccc(NC(=O)CCc2nnc(CCC3CCCCC3)n2C2CCC2)c(C)c1