Reaction Details
TargetEstrogen receptor
LigandBDBM50153697
Substrate/Competitorn/a
Meas. Tech.ChEMBL_1561516 (CHEMBL3776153)
IC50 1.2±n/a nM
Citation Scott, JSBailey, ADavies, RDDegorce, SLMacFaul, PAGingell, HMoss, TNorman, RAPink, JHRabow, AARoberts, BSmith, PD Tetrahydroisoquinoline Phenols: Selective Estrogen Receptor Downregulator Antagonists with Oral Bioavailability in Rat. ACS Med Chem Lett7:94-9 (2016) 
 
Estrogen receptor
Name:Estrogen receptor
Type:Protein
Mol. Mass.:66230.44
Organism:Homo sapiens (Human)
Description:P03372
Residue:595
BDBM50153697
NameBDBM50153697
Synonyms:CHEMBL3774737
TypeSmall organic molecule
Emp. Form.C24H27F2NO4
Mol. Mass.431.4723
SMILESCOC[C@H](C)CN1[C@H](C)Cc2cc(O)ccc2[C@H]1c1c(F)cc(\C=C\C(O)=O)cc1F