Reaction Details
TargetEstrogen receptor
LigandBDBM50153707
Substrate/Competitorn/a
Meas. Tech.ChEMBL_1561516 (CHEMBL3776153)
IC50 4.4±n/a nM
Citation Scott, JSBailey, ADavies, RDDegorce, SLMacFaul, PAGingell, HMoss, TNorman, RAPink, JHRabow, AARoberts, BSmith, PD Tetrahydroisoquinoline Phenols: Selective Estrogen Receptor Downregulator Antagonists with Oral Bioavailability in Rat. ACS Med Chem Lett7:94-9 (2016) 
 
Estrogen receptor
Name:Estrogen receptor
Type:Protein
Mol. Mass.:66230.44
Organism:Homo sapiens (Human)
Description:P03372
Residue:595
BDBM50153707
NameBDBM50153707
Synonyms:CHEMBL3775824
TypeSmall organic molecule
Emp. Form.C22H25NO3
Mol. Mass.351.4388
SMILESCC(C)CN1CCc2cc(O)ccc2[C@H]1c1ccc(\C=C\C(O)=O)cc1