Reaction Details
TargetProto-oncogene tyrosine-protein kinase receptor Ret
LigandBDBM4627
Substrate/Competitorn/a
Meas. Tech.ChEMBL_1560166 (CHEMBL3778237)
IC50 0.750000±n/a nM
Citation Newton, RBowler, KABurns, EMChapman, PJFairweather, EEFritzl, SJGoldberg, KMHamilton, NMHolt, SVHopkins, GVJones, SDJordan, AMLyons, AJNikki March, HMcDonald, NQMaguire, LAMould, DPPurkiss, AGSmall, HFStowell, AIThomson, GJWaddell, IDWaszkowycz, BWatson, AJOgilvie, DJ The discovery of 2-substituted phenol quinazolines as potent RET kinase inhibitors with improved KDR selectivity. Eur J Med Chem112:20-32 (2016) 
 
Proto-oncogene tyrosine-protein kinase receptor Ret
Name:Proto-oncogene tyrosine-protein kinase receptor Ret
Type:Protein
Mol. Mass.:124318.29
Organism:Homo sapiens (Human)
Description:P07949
Residue:1114
BDBM4627
NameBDBM4627
Synonyms:5-[(6,7-dimethoxyquinazolin-4-yl)amino]-4-fluoro-2-methylphenol | Anilinoquinazoline deriv. 10
TypeSmall organic molecule
Emp. Form.C17H16FN3O3
Mol. Mass.329.3256
SMILESCOc1cc2ncnc(Nc3cc(O)c(C)cc3F)c2cc1OC