Reaction Details
TargetVascular endothelial growth factor receptor 2
LigandBDBM50154248
Substrate/Competitorn/a
Meas. Tech.ChEMBL_1560167 (CHEMBL3778238)
IC50 58±n/a nM
Citation Newton, RBowler, KABurns, EMChapman, PJFairweather, EEFritzl, SJGoldberg, KMHamilton, NMHolt, SVHopkins, GVJones, SDJordan, AMLyons, AJNikki March, HMcDonald, NQMaguire, LAMould, DPPurkiss, AGSmall, HFStowell, AIThomson, GJWaddell, IDWaszkowycz, BWatson, AJOgilvie, DJ The discovery of 2-substituted phenol quinazolines as potent RET kinase inhibitors with improved KDR selectivity. Eur J Med Chem112:20-32 (2016) 
 
Vascular endothelial growth factor receptor 2
Name:Vascular endothelial growth factor receptor 2
Type:Receptor Tyrosine Kinase
Mol. Mass.:151510.97
Organism:Homo sapiens (Human)
Description:P35968
Residue:1356
BDBM50154248
NameBDBM50154248
Synonyms:CHEMBL235851
TypeSmall organic molecule
Emp. Form.C16H14ClN3O3
Mol. Mass.331.754
SMILESCOc1cc2ncnc(Nc3ccc(Cl)c(O)c3)c2cc1OC