Reaction Details
TargetKinesin-1 heavy chain/Proto-oncogene tyrosine-protein kinase receptor Ret
LigandBDBM50153908
Substrate/Competitorn/a
Meas. Tech.ChEMBL_1560169 (CHEMBL3778240)
IC50 85±n/a nM
Citation Newton, RBowler, KABurns, EMChapman, PJFairweather, EEFritzl, SJGoldberg, KMHamilton, NMHolt, SVHopkins, GVJones, SDJordan, AMLyons, AJNikki March, HMcDonald, NQMaguire, LAMould, DPPurkiss, AGSmall, HFStowell, AIThomson, GJWaddell, IDWaszkowycz, BWatson, AJOgilvie, DJ The discovery of 2-substituted phenol quinazolines as potent RET kinase inhibitors with improved KDR selectivity. Eur J Med Chem112:20-32 (2016) 
 
Kinesin-1 heavy chain/Proto-oncogene tyrosine-protein kinase receptor Ret
Name:Kinesin-1 heavy chain/Proto-oncogene tyrosine-protein kinase receptor Ret
Synonyms:Kinesin-1 heavy chain/ Tyrosine-protein kinase receptor RET
Type:n/a
Mol. Mass.:n/a
Description:ASSAY_ID of ChEMBL is 1972971
Components:This complex has 2 components.
Component 1
Name:Proto-oncogene tyrosine-protein kinase receptor Ret
Type:Protein
Mol. Mass.:124318.29
Organism:Homo sapiens (Human)
Description:P07949
Residue:1114
Component 2
Name:Kinesin-1 heavy chain
Synonyms:KIF5B KNS | KNS1
Type:PROTEIN
Mol. Mass.:109682.61
Organism:Homo sapiens (Human)
Description:ChEMBL_770435
Residue:963
BDBM50153908
NameBDBM50153908
Synonyms:CHEMBL3774489
TypeSmall organic molecule
Emp. Form.C16H14ClN3O3
Mol. Mass.331.754
SMILESCOc1cc2ncnc(Nc3cc(O)ccc3Cl)c2cc1OC