Reaction Details
TargetVascular endothelial growth factor receptor 2
LigandBDBM4627
Substrate/Competitorn/a
Meas. Tech.ChEMBL_1560170 (CHEMBL3778241)
IC50 9.5±n/a nM
Citation Newton, RBowler, KABurns, EMChapman, PJFairweather, EEFritzl, SJGoldberg, KMHamilton, NMHolt, SVHopkins, GVJones, SDJordan, AMLyons, AJNikki March, HMcDonald, NQMaguire, LAMould, DPPurkiss, AGSmall, HFStowell, AIThomson, GJWaddell, IDWaszkowycz, BWatson, AJOgilvie, DJ The discovery of 2-substituted phenol quinazolines as potent RET kinase inhibitors with improved KDR selectivity. Eur J Med Chem112:20-32 (2016) 
 
Vascular endothelial growth factor receptor 2
Name:Vascular endothelial growth factor receptor 2
Type:Receptor Tyrosine Kinase
Mol. Mass.:151510.97
Organism:Homo sapiens (Human)
Description:P35968
Residue:1356
BDBM4627
NameBDBM4627
Synonyms:5-[(6,7-dimethoxyquinazolin-4-yl)amino]-4-fluoro-2-methylphenol | Anilinoquinazoline deriv. 10
TypeSmall organic molecule
Emp. Form.C17H16FN3O3
Mol. Mass.329.3256
SMILESCOc1cc2ncnc(Nc3cc(O)c(C)cc3F)c2cc1OC