Reaction Details
TargetVascular endothelial growth factor receptor 2
LigandBDBM50153902
Substrate/Competitorn/a
Meas. Tech.ChEMBL_1560170 (CHEMBL3778241)
IC50 770±n/a nM
Citation Newton, RBowler, KABurns, EMChapman, PJFairweather, EEFritzl, SJGoldberg, KMHamilton, NMHolt, SVHopkins, GVJones, SDJordan, AMLyons, AJNikki March, HMcDonald, NQMaguire, LAMould, DPPurkiss, AGSmall, HFStowell, AIThomson, GJWaddell, IDWaszkowycz, BWatson, AJOgilvie, DJ The discovery of 2-substituted phenol quinazolines as potent RET kinase inhibitors with improved KDR selectivity. Eur J Med Chem112:20-32 (2016) 
 
Vascular endothelial growth factor receptor 2
Name:Vascular endothelial growth factor receptor 2
Type:Receptor Tyrosine Kinase
Mol. Mass.:151510.97
Organism:Homo sapiens (Human)
Description:P35968
Residue:1356
BDBM50153902
NameBDBM50153902
Synonyms:CHEMBL3775557
TypeSmall organic molecule
Emp. Form.C16H13F2N3O3
Mol. Mass.333.2895
SMILESCOc1cc2ncnc(Nc3c(F)ccc(O)c3F)c2cc1OC