Reaction Details
TargetEstrogen receptor beta
LigandBDBM20608
Substrate/Competitorn/a
Meas. Tech.ChEMBL_1561163 (CHEMBL3777356)
IC50 100±n/a nM
Citation Ahmed, NSElghazawy, NHElHady, AKEngel, MHartmann, RWAbadi, AH Design and synthesis of novel tamoxifen analogues that avoid CYP2D6 metabolism. Eur J Med Chem112:171-9 (2016) 
 
Estrogen receptor beta
Name:Estrogen receptor beta
Type:Protein
Mol. Mass.:59238.43
Organism:Homo sapiens (Human)
Description:Q92731
Residue:530
BDBM20608
NameBDBM20608
Synonyms:4-Hydroxytamoxifen 4-[(1Z)-1-{4-[2-(dimethylamino)ethoxy]phenyl}-2-phenylbut-1-en-1-yl]phenol CHEMBL489 cid_449459
TypeSmall organic molecule
Emp. Form.C26H29NO2
Mol. Mass.387.514
SMILESCC\C(=C(/c1ccc(O)cc1)c1ccc(OCCN(C)C)cc1)c1ccccc1