Reaction Details
TargetDual specificity tyrosine-phosphorylation-regulated kinase 1B
LigandBDBM50154342
Substrate/Competitorn/a
Meas. Tech.ChEMBL_1560173 (CHEMBL3778244)
IC50 60±n/a nM
Citation Mariano, MHartmann, RWEngel, M Systematic diversification of benzylidene heterocycles yields novel inhibitor scaffolds selective for Dyrk1A, Clk1 and CK2. Eur J Med Chem112:209-16 (2016) 
 
Dual specificity tyrosine-phosphorylation-regulated kinase 1B
Name:Dual specificity tyrosine-phosphorylation-regulated kinase 1B
Type:Enzyme
Mol. Mass.:69222.24
Organism:Homo sapiens (Human)
Description:Q9Y463
Residue:629
BDBM50154342
NameBDBM50154342
Synonyms:CHEMBL3774448
TypeSmall organic molecule
Emp. Form.C13H8N2OS2
Mol. Mass.272.345
SMILESO=C1NC(=S)S\C1=C/c1ccc2ncccc2c1