Reaction Details
TargetDual specificity tyrosine-phosphorylation-regulated kinase 1A
LigandBDBM50324735
Substrate/Competitorn/a
Meas. Tech.ChEMBL_1560172 (CHEMBL3778243)
IC50 30±n/a nM
Citation Mariano, MHartmann, RWEngel, M Systematic diversification of benzylidene heterocycles yields novel inhibitor scaffolds selective for Dyrk1A, Clk1 and CK2. Eur J Med Chem112:209-16 (2016) 
 
Dual specificity tyrosine-phosphorylation-regulated kinase 1A
Name:Dual specificity tyrosine-phosphorylation-regulated kinase 1A
Type:Enzyme
Mol. Mass.:85616.61
Organism:Homo sapiens (Human)
Description:Q13627
Residue:763
BDBM50324735
NameBDBM50324735
Synonyms:(5E)-5-(QUINOXALIN-6-YLMETHYLENE)-1,3-THIAZOLIDINE-2,4-DIONE AS-605240 CHEMBL568150
TypeSmall organic molecule
Emp. Form.C12H7N3O2S
Mol. Mass.257.268
SMILESOC1=NC(=O)C(S1)=Cc1ccc2nccnc2c1