Reaction Details
TargetDual specificity tyrosine-phosphorylation-regulated kinase 1A
LigandBDBM100152
Substrate/Competitorn/a
Meas. Tech.ChEMBL_1560172 (CHEMBL3778243)
IC50 130±n/a nM
Citation Mariano, MHartmann, RWEngel, M Systematic diversification of benzylidene heterocycles yields novel inhibitor scaffolds selective for Dyrk1A, Clk1 and CK2. Eur J Med Chem112:209-16 (2016) 
 
Dual specificity tyrosine-phosphorylation-regulated kinase 1A
Name:Dual specificity tyrosine-phosphorylation-regulated kinase 1A
Type:Enzyme
Mol. Mass.:85616.61
Organism:Homo sapiens (Human)
Description:Q13627
Residue:763
BDBM100152
NameBDBM100152
Synonyms:7-methoxy-1-methyl-9H-beta-carboline;hydrochloride HARMINE MLS002153910 cid_5359389
TypeSmall organic molecule
Emp. Form.C13H12N2O
Mol. Mass.212.2472
SMILESCOc1ccc2c(c1)[nH]c1c(C)nccc21