Reaction Details
TargetDual specificity protein kinase CLK1
LigandBDBM50154341
Substrate/Competitorn/a
Meas. Tech.ChEMBL_1560176 (CHEMBL3778247)
IC50 20±n/a nM
Citation Mariano, MHartmann, RWEngel, M Systematic diversification of benzylidene heterocycles yields novel inhibitor scaffolds selective for Dyrk1A, Clk1 and CK2. Eur J Med Chem112:209-16 (2016) 
 
Dual specificity protein kinase CLK1
Name:Dual specificity protein kinase CLK1
Type:Protein
Mol. Mass.:57322.21
Organism:Homo sapiens (Human)
Description:P49759
Residue:484
BDBM50154341
NameBDBM50154341
Synonyms:CHEMBL3775754
TypeSmall organic molecule
Emp. Form.C11H7N3OS2
Mol. Mass.261.323
SMILESO=C1NC(=S)N\C1=C/c1ccc2ncsc2c1