Reaction Details
TargetDual specificity protein kinase CLK3
LigandBDBM50154342
Substrate/Competitorn/a
Meas. Tech.ChEMBL_1560208 (CHEMBL3778447)
IC50 87±n/a nM
Citation Mariano, MHartmann, RWEngel, M Systematic diversification of benzylidene heterocycles yields novel inhibitor scaffolds selective for Dyrk1A, Clk1 and CK2. Eur J Med Chem112:209-16 (2016) 
 
Dual specificity protein kinase CLK3
Name:Dual specificity protein kinase CLK3
Type:Protein
Mol. Mass.:73570.11
Organism:Homo sapiens (Human)
Description:n/a
Residue:638
BDBM50154342
NameBDBM50154342
Synonyms:CHEMBL3774448
TypeSmall organic molecule
Emp. Form.C13H8N2OS2
Mol. Mass.272.345
SMILESO=C1NC(=S)S\C1=C/c1ccc2ncccc2c1